{"text_format":"1","workbook":"xlsx","n_sheets":5,"sheets":["Packaged Unit","DATA","CabPics","Logos","Revisions"],"not_rendered":{"charts":0,"images":12,"macros":1,"external_links":0,"defined_names":9,"comments":1,"pivot_tables":0},"unopened":[],"bounds":{"document_bytes":16777216,"sheet_cells":100000,"rows_first":2000,"rows_last":500,"rows_between":2000,"halvings":0,"cell_chars":16384,"cell_head_chars":4096},"cells_cut":0,"cells_raw":0,"read":"whole","date_system":"1900"}

{"sheet":"Packaged Unit","index":0,"n_rows":57,"n_cols":43,"rows_kept":57,"cut":false,"hidden":false,"merged":[[57,0,69,13],[70,0,79,13],[47,10,47,13],[48,10,48,13],[49,10,49,13],[50,11,50,13],[51,11,51,13],[52,0,52,2],[52,3,52,6],[52,7,52,8],[52,9,52,12],[54,7,54,8],[53,0,53,2],[53,3,53,6],[53,9,53,12],[54,0,54,2],[54,3,54,6],[54,9,54,12],[55,0,55,2],[55,3,55,6],[55,7,55,8],[55,9,55,12],[56,0,56,2],[34,0,34,13],[56,3,56,6],[56,7,56,8],[56,9,56,12],[41,0,41,5],[43,0,43,13],[43,37,43,38],[44,0,46,13],[44,37,44,38],[40,0,40,5],[35,0,35,12],[37,0,37,5],[38,0,38,5],[39,0,39,5],[15,20,15,25],[22,0,22,13],[23,0,23,13],[24,0,24,13],[25,0,25,13],[26,2,26,3],[15,1,15,13],[27,0,27,1],[27,2,27,3],[26,10,26,11],[26,5,26,9],[32,0,32,2],[32,6,32,7],[32,8,32,9],[32,10,32,11],[33,0,33,2],[33,6,33,7],[13,3,13,4],[13,5,13,7],[13,8,13,9],[13,11,13,12],[31,4,31,7],[28,0,28,1],[28,2,28,3],[31,0,31,2],[33,8,33,9],[33,10,33,11],[13,0,13,2],[9,0,9,2],[9,3,9,6],[9,7,9,8],[9,9,9,12],[12,3,12,4],[12,5,12,7],[12,8,12,9],[12,11,12,12],[10,0,10,2],[10,3,10,6],[10,7,10,8],[10,9,10,12],[11,0,11,12],[12,0,12,2],[6,7,6,8],[6,9,6,12],[8,0,8,2],[8,3,8,6],[8,7,8,8],[8,9,8,12],[7,0,7,2],[7,3,7,6],[7,9,7,12],[6,0,6,2],[6,3,6,6],[0,0,4,4],[0,5,0,9],[0,10,0,13],[1,5,1,9],[1,10,1,13],[2,5,2,9],[2,10,2,13],[3,5,3,9],[3,11,3,13],[4,5,4,9],[4,11,4,13]]}
[null,null,null,null,null,"HEAT TRANSFER PRODUCTS GROUP, LLC",null,null,null,null,"SUBMITTAL DATA SHEET"]
[null,null,null,null,null,"3885 Crestwood Parkway / Suite 500",null,null,null,null,"Packaged Refrigeration Unit"]
[null,null,null,null,null,"Duluth, GA  30096"]
[null,null,null,null,null,"(P) 800-288-9488 / (F) 256-259-7478",null,null,null,null,null,"For Record Only"]
[null,null,null,null,null,"https://www.htpg.com/",null,null,null,null,null,"For Approval",null,null,null,null,null,null,"Base Model"]
[null,null,null,null,null,null,null,null,null,null,null,null,null,null,null,null,null,null,{"$f":"X13&Y13&Z13&AB13","v":{"$error":"#N/A"}},null,null,null,null,null,null,null,null,null,null,null,null,null,null,null,null,null,null,null,null,null,null,{"$f":"IF(AND(D14=\"Hermetic\",OR(Y13=\"055\",Y13=\"080\")),\"\",\"208-230/3/60\")","v":"208-230/3/60"}]
["Job Name:",null,null,null,null,null,null,"Job Location:",null,null,null,null,null,null,null,null,null,null,null,null,null,null,null,null,null,null,null,null,null,null,null,"REFRIG OPTS"]
["Customer Name:",null,null,null,null,null,null,"Order Number:",null,null,null,null,null,null,null,null,null,null,{"$f":"L14","v":0},null,null,"Russell",null,null,null,"Packaged Refrig.","HP",null,null,null,null,"448A","448A",48,null,"Scroll","O",null,{"$f":"IF(D14=\"Scroll\",\"Low\",\"\")","v":""},"L",null,{"$f":"IFERROR(IF(OR(I14=V19,I14=V20,I14=V21,I14=V22,Z13=AN10),\"\",\"115/1/60\"),\"\")","v":""},"A"]
["Architect / Engineer:",null,null,null,null,null,null,"Prepared By:",null,null,null,null,null,null,null,null,null,null,null,null,null,"Witt",null,null,null,null,null,null,null,null,null,null,null,null,null,"Hermetic","H",null,"Medium","M",null,"208-230/1/60","D"]
["Unit Model Number:",null,null,{"$f":"IFERROR(V14,\"\")","v":""},null,null,null,"Tagging Info:",null,null,null,null,null,null,null,null,null,null,null,null,null,"Kramer",null,null,null,null,null,null,null,null,null,null,null,null,null,null,null,null,"Medium (Electric Defrost)","D"]
["Unit Quantity:",null,null,null,null,null,null,"Date:",null,{"$f":"NOW()","v":"2023-08-30T13:33:34.720"},null,null,null,null,null,null,null,null,null,null,null,"None"]
["Select unit attributes from the drop down menus below to build required model number",null,null,null,null,null,null,null,null,null,null,null,null,null,null,null,null,null,null,null,"Brand",null,"Product","Comp","HP","Temp","Voltage","Refrig.","Vintage"]
["Brand",null,null,"Compr.",null,"Temp Range",null,null,"HP",null,"Refr.","Voltage",null,null,null,null,null,{"$f":"U13&W13&X13&Y13&Z13&AB13&AA13&AC13","v":{"$error":"#N/A"}},null,null,{"$f":"VLOOKUP(A14,V8:W11,2,FALSE)","v":{"$error":"#N/A"}},null,{"$f":"AA8","v":"HP"},{"$f":"IF(D14=\"Scroll\",\"O\",IF(D14=\"Hermetic\",\"H\",\"FALSE\"))","v":"FALSE"},{"$f":"LEFT(I14,3)","v":""},{"$f":"VLOOKUP(F14,AM8:AN10,2,FALSE)","v":{"$error":"#N/A"}},{"$f":"VLOOKUP(L14,AP8:AQ10,2,FALSE)","v":{"$error":"#N/A"}},{"$f":"AH16","v":{"$error":"#N/A"}},"A"]
[null,null,null,null,null,null,null,null,null,null,null,null,null,null,null,null,null,null,null,null,"Unit #",{"$f":"V15&AC13","v":{"$error":"#N/A"}},null,"Look-up ID"]
["**clear all fields when starting over**",null,null,null,null,null,null,null,null,null,null,null,null,null,null,null,null,null,null,null,"Russel #",{"$f":"W13&X13&Y13&Z13&AB13&AA13","v":{"$error":"#N/A"}},null,{"$f":"X13&Y13&Z13&AB13&AA13&\"-\"","v":{"$error":"#N/A"}},null,{"$f":"VLOOKUP(P39,AN15:AO197,2,FALSE)","v":{"$error":"#N/A"}},null,null,null,null,null,"Data Lookup",null,"Refrigerant Code"]
["Ambient",{"$f":"\"Capacity Data by Outdoor Ambient and Box Temperature (ºF) for \"&K14","v":"Capacity Data by Outdoor Ambient and Box Temperature (ºF) for "},null,null,null,null,null,null,null,null,null,null,null,null,null,null,null,null,null,null,"Capacity Values",null,null,null,null,null,null,null,null,null,null,{"$f":"VLOOKUP(K14,AF8:AG13,2,FALSE)","v":{"$error":"#N/A"}},null,{"$f":"VLOOKUP(K14,AF8:AH13,3,FALSE)","v":{"$error":"#N/A"}},null,null,"Application Code"]
["Temp ºF",38,35,0,-10,-20,null,null,null,null,null,null,null,null,null,null,null,null,"XX",null,null,1,2,3,4,5,null,null,null,null,null,null,null,null,null,null,{"$f":"VLOOKUP(F14,AM8:AO10,2,FALSE)","v":{"$error":"#N/A"}}]
[80,{"$f":"IFERROR(VLOOKUP($X$15&$A18,DATA!$K$2:$P$500,2,FALSE),\"\")","v":""},{"$f":"IFERROR(VLOOKUP($X$15&$A18,DATA!$K$2:$P$500,3,FALSE),\"\")","v":""},{"$f":"IFERROR(VLOOKUP($X$15&$A18,DATA!$K$2:$P$500,4,FALSE),\"\")","v":""},{"$f":"IFERROR(VLOOKUP($X$15&$A18,DATA!$K$2:$P$500,5,FALSE),\"\")","v":""},{"$f":"IFERROR(VLOOKUP($X$15&$A18,DATA!$K$2:$P$500,6,FALSE),\"\")","v":""},null,null,null,null,null,null,null,null,null,null,null,null,null,null,null,"HPOL","HPOM","HPOD","HPHM","HPHD"]
[90,{"$f":"IFERROR(VLOOKUP($X$15&$A19,DATA!$K$2:$P$500,2,FALSE),\"\")","v":""},{"$f":"IFERROR(VLOOKUP($X$15&$A19,DATA!$K$2:$P$500,3,FALSE),\"\")","v":""},{"$f":"IFERROR(VLOOKUP($X$15&$A19,DATA!$K$2:$P$500,4,FALSE),\"\")","v":""},{"$f":"IFERROR(VLOOKUP($X$15&$A19,DATA!$K$2:$P$500,5,FALSE),\"\")","v":""},{"$f":"IFERROR(VLOOKUP($X$15&$A19,DATA!$K$2:$P$500,6,FALSE),\"\")","v":""},null,null,null,null,null,null,null,null,null,null,null,null,null,null,1,"150 - 1-1/2HP","080 - 3/4HP","080 - 3/4HP","050 - 1/2HP","050 - 1/2HP"]
[95,{"$f":"IFERROR(VLOOKUP($X$15&$A20,DATA!$K$2:$P$500,2,FALSE),\"\")","v":""},{"$f":"IFERROR(VLOOKUP($X$15&$A20,DATA!$K$2:$P$500,3,FALSE),\"\")","v":""},{"$f":"IFERROR(VLOOKUP($X$15&$A20,DATA!$K$2:$P$500,4,FALSE),\"\")","v":""},{"$f":"IFERROR(VLOOKUP($X$15&$A20,DATA!$K$2:$P$500,5,FALSE),\"\")","v":""},{"$f":"IFERROR(VLOOKUP($X$15&$A20,DATA!$K$2:$P$500,6,FALSE),\"\")","v":""},null,null,null,null,null,null,null,null,null,null,null,1,{"$f":"VLOOKUP(R20,$U$19:$Z$31,$S$39,FALSE)","v":{"$error":"#REF!"}},null,2,"250 - 2-1/2HP","100 - 1HP","100 - 1HP","055 - 1/2HP","055 - 1/2HP"]
[100,{"$f":"IFERROR(VLOOKUP($X$15&$A21,DATA!$K$2:$P$500,2,FALSE),\"\")","v":""},{"$f":"IFERROR(VLOOKUP($X$15&$A21,DATA!$K$2:$P$500,3,FALSE),\"\")","v":""},{"$f":"IFERROR(VLOOKUP($X$15&$A21,DATA!$K$2:$P$500,4,FALSE),\"\")","v":""},{"$f":"IFERROR(VLOOKUP($X$15&$A21,DATA!$K$2:$P$500,5,FALSE),\"\")","v":""},{"$f":"IFERROR(VLOOKUP($X$15&$A21,DATA!$K$2:$P$500,6,FALSE),\"\")","v":""},null,null,null,null,null,null,null,null,null,null,null,2,{"$f":"VLOOKUP(R21,$U$19:$Z$31,$S$39,FALSE)","v":{"$error":"#REF!"}},null,3,"300 - 3HP","120 - 1-1/4HP","120 - 1-1/4HP",null,null,null,null,null,null,null,"HP"]
[110,{"$f":"IFERROR(VLOOKUP($X$15&$A22,DATA!$K$2:$P$500,2,FALSE),\"\")","v":""},{"$f":"IFERROR(VLOOKUP($X$15&$A22,DATA!$K$2:$P$500,3,FALSE),\"\")","v":""},{"$f":"IFERROR(VLOOKUP($X$15&$A22,DATA!$K$2:$P$500,4,FALSE),\"\")","v":""},{"$f":"IFERROR(VLOOKUP($X$15&$A22,DATA!$K$2:$P$500,5,FALSE),\"\")","v":""},{"$f":"IFERROR(VLOOKUP($X$15&$A22,DATA!$K$2:$P$500,6,FALSE),\"\")","v":""},null,null,null,null,null,null,null,null,null,null,null,3,{"$error":"#REF!"},null,4,"350 - 3-1/2HP","150 - 1-1/2HP","150 - 1-1/2HP",null,null,null,null,null,null,null,150]
["Notes:",null,null,null,null,null,null,null,null,null,null,null,null,null,null,null,null,4,{"$error":"#REF!"},null,5,null,null,null,null,null,null,null,null,null,null,250]
["All capacities are calculated at 65ºF return gas temperature and dew point values.",null,null,null,null,null,null,null,null,null,null,null,null,null,null,null,null,5,{"$error":"#REF!"},null,6,null,null,null,null,null,null,null,null,null,null,300]
[null,null,null,null,null,null,null,null,null,null,null,null,null,null,null,null,null,6,{"$error":"#REF!"},null,7,null,null,null,null,null,null,null,null,null,null,350]
[null,null,null,null,null,null,null,null,null,null,null,null,null,null,null,null,null,7,{"$error":"#REF!"},null,8]
[null,null,"Compressor",null,null,"Approximate Dimensions & Weight",null,null,null,null,"AWEF",null,null,null,null,null,null,8,{"$error":"#REF!"},null,9]
["Model",null,"HP",null,null,"Length","Width","Height","Weight","Cabinet ","Indoor","Outdoor",null,null,null,null,null,9,{"$error":"#REF!"},null,10]
[{"$f":"IFERROR(V14,\"\")","v":""},null,{"$f":"IFERROR(VLOOKUP($X$15&$A18,DATA!$K$2:$Q$500,7,FALSE),\"\")","v":""},null,null,{"$f":"IF(I29=\"\",\"\",55.5)","v":""},{"$f":"IF(F29=\"\",\"\",IF(J29=\"LARGE\",36.69,32.19))","v":""},{"$f":"IF(K29=\"\",\"\",24.75)","v":""},{"$f":"IFERROR(VLOOKUP($X$15&$A18,DATA!$K$2:$AF$500,20,FALSE),\"\")","v":""},{"$f":"IFERROR(VLOOKUP($X$15&$A18,DATA!$K$2:$AF$500,19,FALSE),\"\")","v":""},{"$f":"IFERROR(VLOOKUP($X$15&$A18,DATA!$K$2:$S$500,8,FALSE),\"\")","v":""},{"$f":"IFERROR(VLOOKUP($X$15&$A18,DATA!$K$2:$S$500,9,FALSE),\"\")","v":""},null,{"$f":"IFERROR(VLOOKUP(V13&\"*\"&X13&Y13&Z13&AB13&\"**\",#REF!,IF(K14=\"404A\",2,IF(K14=\"407A\",3,IF(K14=\"407C\",4,IF(K14=\"448A\",5,6)))),FALSE),\"\")","v":""},null,null,null,10,{"$error":"#REF!"},null,11]
[null,null,null,null,null,null,null,null,null,null,null,null,null,null,null,null,null,11,{"$error":"#REF!"},null,12]
[null,null,null,null,null,null,null,null,null,null,null,null,null,null,{"$f":"V13&\"*\"&X13&Y13&Z13&AB13&\"**\"","v":{"$error":"#N/A"}},null,null,12,{"$error":"#REF!"}]
["Defrost Type - Input",null,null,null,{"$f":"IF(A34=\"\",\"Electrical Data - PLEASE MAKE SELECTION\",\"Electrical Data - \"&A34)","v":"Electrical Data - PLEASE MAKE SELECTION"}]
[null,null,null,null,"MCA","MOPD","Unit Amps",null,null,null,null,null,null,null,null,null,null,{"$f":"AJ8&AM8","v":"Scroll"},2]
[null,null,null,null,{"$f":"IFERROR(VLOOKUP(V41,DATA!$T$2:$AG$500,4,FALSE),\"\")","v":""},{"$f":"IFERROR(VLOOKUP(V41,DATA!$T$2:$AG$500,5,FALSE),\"\")","v":""},{"$f":"IFERROR(VLOOKUP(V41,DATA!$T$2:$AG$500,6,FALSE),\"\")","v":""},null,null,null,null,null,null,null,null,null,null,{"$f":"AJ8&AM9","v":"ScrollMedium"},3]
["† Note: Maximum Evap. fan amps and maximum defrost amps are shown to provide ratings when electric defrost is required and is an optional feature. Maximum Amp value used to determine MOPD. Exceeding these values invalidates the listed MOPD and requires a revised calculation. Contact Application Engineering when amp draw requirements deviate from the chart values.",null,null,null,null,null,null,null,null,null,null,null,null,null,null,null,null,{"$f":"AJ8&AM10","v":"ScrollMedium (Electric Defrost)"},4]
["Options (Select catalog options from drop down menu.)",null,null,null,null,null,null,null,null,null,null,null,null,null,null,null,null,{"$f":"AJ9&AM9","v":"HermeticMedium"},5]
[null,null,null,null,null,null,null,null,null,null,null,null,null,null,null,null,null,{"$f":"AJ9&AM10","v":"HermeticMedium (Electric Defrost)"},6]
[]
[null,null,null,null,null,null,null,null,null,null,null,null,null,null,null,null,null,null,{"$f":"VLOOKUP(D14&F14,R33:S37,2,FALSE)","v":{"$error":"#N/A"}}]
[]
{"$rows_left_out":18}
{"sheet":"DATA","index":1,"n_rows":106,"n_cols":33,"rows_kept":106,"cut":false,"hidden":true,"merged":[]}
["Model Family","Model Number","Compressor Type","Refrigerant","Refrigerant Code","Application","Application Code","Voltage Code","Defost Code","Ambient","Look-up ID",38,35,0,-10,-20,"Compressor HP","Indoor AWEF","Outdoor AWEF","Look-up ID Elec","Defrost Type","Voltage","MCA","MOPD","Unit Amps","U.C. CFM","Plug Available?","NEMA Receptical","Cabinet Size","Aprx. Net Weight - LBs","Aprx. Net Weight - Kg","Aprx. Ship Weight - LB","Aprx. Ship Weight - KG"]
["PACKAGED UNIT","H050D48","HERMETIC","448A",48,"MEDIUM (ELECTRIC DEFROST)","D","D",{"$f":"IF(U2=\"AIR\",\"A\",\"E\")","v":"E"},100,{"$f":"B2&H2&\"-\"&J2","v":"H050D48D-100"},5470,5170,null,null,null,0.5,5.61,7.6,{"$f":"K2&\"-\"&I2","v":"H050D48D-100-E"},"ELECTRIC","208-230/1/60",15,15,8.3000000000000007,600,"KIT","6-15R","SMALL",206,93.4,286,129.69999999999999]
["PACKAGED UNIT","H050D48","HERMETIC","448A",48,"MEDIUM (ELECTRIC DEFROST)","D","D","E",110,"H050D48D-110",5090,4790,null,null,null,0.5,5.61,7.6,"H050D48D-110-E","ELECTRIC","208-230/1/60",15,15,8.3000000000000007,600,"KIT","6-15R","SMALL",206,93.4,286,129.69999999999999]
["PACKAGED UNIT","H050D48","HERMETIC","448A",48,"MEDIUM (ELECTRIC DEFROST)","D","D","E",80,"H050D48D-80",6290,5960,null,null,null,0.5,5.61,7.6,"H050D48D-80-E","ELECTRIC","208-230/1/60",15,15,8.3000000000000007,600,"KIT","6-15R","SMALL",206,93.4,286,129.69999999999999]
["PACKAGED UNIT","H050D48","HERMETIC","448A",48,"MEDIUM (ELECTRIC DEFROST)","D","D","E",90,"H050D48D-90",5870,5550,null,null,null,0.5,5.61,7.6,"H050D48D-90-E","ELECTRIC","208-230/1/60",15,15,8.3000000000000007,600,"KIT","6-15R","SMALL",206,93.4,286,129.69999999999999]
["PACKAGED UNIT","H050D48","HERMETIC","448A",48,"MEDIUM (ELECTRIC DEFROST)","D","D","E",95,"H050D48D-95",5670,5360,null,null,null,0.5,5.61,7.6,"H050D48D-95-E","ELECTRIC","208-230/1/60",15,15,8.3000000000000007,600,"KIT","6-15R","SMALL",206,93.4,286,129.69999999999999]
["PACKAGED UNIT","H050M48","HERMETIC","448A",48,"MEDIUM","M","A","A",100,"H050M48A-100",5470,5170,null,null,null,0.5,5.61,7.6,"H050M48A-100-A","AIR","115/1/60",15,20,10.5,600,"KIT","5-20R","SMALL",206,93.4,286,129.69999999999999]
["PACKAGED UNIT","H050M48","HERMETIC","448A",48,"MEDIUM","M","A","A",110,"H050M48A-110",5090,4790,null,null,null,0.5,5.61,7.6,"H050M48A-110-A","AIR","115/1/60",15,20,10.5,600,"KIT","5-20R","SMALL",206,93.4,286,129.69999999999999]
["PACKAGED UNIT","H050M48","HERMETIC","448A",48,"MEDIUM","M","A","A",80,"H050M48A-80",6290,5960,null,null,null,0.5,5.61,7.6,"H050M48A-80-A","AIR","115/1/60",15,20,10.5,600,"KIT","5-20R","SMALL",206,93.4,286,129.69999999999999]
["PACKAGED UNIT","H050M48","HERMETIC","448A",48,"MEDIUM","M","A","A",90,"H050M48A-90",5870,5550,null,null,null,0.5,5.61,7.6,"H050M48A-90-A","AIR","115/1/60",15,20,10.5,600,"KIT","5-20R","SMALL",206,93.4,286,129.69999999999999]
["PACKAGED UNIT","H050M48","HERMETIC","448A",48,"MEDIUM","M","A","A",95,"H050M48A-95",5670,5360,null,null,null,0.5,5.61,7.6,"H050M48A-95-A","AIR","115/1/60",15,20,10.5,600,"KIT","5-20R","SMALL",206,93.4,286,129.69999999999999]
["PACKAGED UNIT","H050M48","HERMETIC","448A",48,"MEDIUM","M","D","A",100,"H050M48D-100",5470,5170,null,null,null,0.5,5.61,7.6,"H050M48D-100-A","AIR","208-230/1/60",15,15,6.6,600,"KIT","6-15R","SMALL",206,93.4,286,129.69999999999999]
["PACKAGED UNIT","H050M48","HERMETIC","448A",48,"MEDIUM","M","D","A",110,"H050M48D-110",5090,4790,null,null,null,0.5,5.61,7.6,"H050M48D-110-A","AIR","208-230/1/60",15,15,6.6,600,"KIT","6-15R","SMALL",206,93.4,286,129.69999999999999]
["PACKAGED UNIT","H050M48","HERMETIC","448A",48,"MEDIUM","M","D","A",80,"H050M48D-80",6290,5960,null,null,null,0.5,5.61,7.6,"H050M48D-80-A","AIR","208-230/1/60",15,15,6.6,600,"KIT","6-15R","SMALL",206,93.4,286,129.69999999999999]
["PACKAGED UNIT","H050M48","HERMETIC","448A",48,"MEDIUM","M","D","A",90,"H050M48D-90",5870,5550,null,null,null,0.5,5.61,7.6,"H050M48D-90-A","AIR","208-230/1/60",15,15,6.6,600,"KIT","6-15R","SMALL",206,93.4,286,129.69999999999999]
["PACKAGED UNIT","H050M48","HERMETIC","448A",48,"MEDIUM","M","D","A",95,"H050M48D-95",5670,5360,null,null,null,0.5,5.61,7.6,"H050M48D-95-A","AIR","208-230/1/60",15,15,6.6,600,"KIT","6-15R","SMALL",206,93.4,286,129.69999999999999]
["PACKAGED UNIT","H055D48","HERMETIC","448A",48,"MEDIUM (ELECTRIC DEFROST)","D","D","E",100,"H055D48D-100",5950,5610,null,null,null,0.5,5.61,7.6,"H055D48D-100-E","ELECTRIC","208-230/1/60",15,15,8.3000000000000007,600,"KIT","6-15R","SMALL",206,93.4,286,129.69999999999999]
["PACKAGED UNIT","H055D48","HERMETIC","448A",48,"MEDIUM (ELECTRIC DEFROST)","D","D","E",110,"H055D48D-110",5490,5170,null,null,null,0.5,5.61,7.6,"H055D48D-110-E","ELECTRIC","208-230/1/60",15,15,8.3000000000000007,600,"KIT","6-15R","SMALL",206,93.4,286,129.69999999999999]
["PACKAGED UNIT","H055D48","HERMETIC","448A",48,"MEDIUM (ELECTRIC DEFROST)","D","D","E",80,"H055D48D-80",6870,6480,null,null,null,0.5,5.61,7.6,"H055D48D-80-E","ELECTRIC","208-230/1/60",15,15,8.3000000000000007,600,"KIT","6-15R","SMALL",206,93.4,286,129.69999999999999]
["PACKAGED UNIT","H055D48","HERMETIC","448A",48,"MEDIUM (ELECTRIC DEFROST)","D","D","E",90,"H055D48D-90",6400,6040,null,null,null,0.5,5.61,7.6,"H055D48D-90-E","ELECTRIC","208-230/1/60",15,15,8.3000000000000007,600,"KIT","6-15R","SMALL",206,93.4,286,129.69999999999999]
["PACKAGED UNIT","H055D48","HERMETIC","448A",48,"MEDIUM (ELECTRIC DEFROST)","D","D","E",95,"H055D48D-95",6170,5830,null,null,null,0.5,5.61,7.6,"H055D48D-95-E","ELECTRIC","208-230/1/60",15,15,8.3000000000000007,600,"KIT","6-15R","SMALL",206,93.4,286,129.69999999999999]
["PACKAGED UNIT","H055M48","HERMETIC","448A",48,"MEDIUM","M","A","A",100,"H055M48A-100",5950,5610,null,null,null,0.5,5.61,7.6,"H055M48A-100-A","AIR","115/1/60",15,20,11.8,600,"KIT","5-20R","SMALL",206,93.4,286,129.69999999999999]
["PACKAGED UNIT","H055M48","HERMETIC","448A",48,"MEDIUM","M","A","A",110,"H055M48A-110",5490,5170,null,null,null,0.5,5.61,7.6,"H055M48A-110-A","AIR","115/1/60",15,20,11.8,600,"KIT","5-20R","SMALL",206,93.4,286,129.69999999999999]
["PACKAGED UNIT","H055M48","HERMETIC","448A",48,"MEDIUM","M","A","A",80,"H055M48A-80",6870,6480,null,null,null,0.5,5.61,7.6,"H055M48A-80-A","AIR","115/1/60",15,20,11.8,600,"KIT","5-20R","SMALL",206,93.4,286,129.69999999999999]
["PACKAGED UNIT","H055M48","HERMETIC","448A",48,"MEDIUM","M","A","A",90,"H055M48A-90",6400,6040,null,null,null,0.5,5.61,7.6,"H055M48A-90-A","AIR","115/1/60",15,20,11.8,600,"KIT","5-20R","SMALL",206,93.4,286,129.69999999999999]
["PACKAGED UNIT","H055M48","HERMETIC","448A",48,"MEDIUM","M","A","A",95,"H055M48A-95",6170,5830,null,null,null,0.5,5.61,7.6,"H055M48A-95-A","AIR","115/1/60",15,20,11.8,600,"KIT","5-20R","SMALL",206,93.4,286,129.69999999999999]
["PACKAGED UNIT","H055M48","HERMETIC","448A",48,"MEDIUM","M","D","A",100,"H055M48D-100",5950,5610,null,null,null,0.5,5.61,7.6,"H055M48D-100-A","AIR","208-230/1/60",15,15,6.7,600,"KIT","6-15R","SMALL",206,93.4,286,129.69999999999999]
["PACKAGED UNIT","H055M48","HERMETIC","448A",48,"MEDIUM","M","D","A",110,"H055M48D-110",5490,5170,null,null,null,0.5,5.61,7.6,"H055M48D-110-A","AIR","208-230/1/60",15,15,6.7,600,"KIT","6-15R","SMALL",206,93.4,286,129.69999999999999]
["PACKAGED UNIT","H055M48","HERMETIC","448A",48,"MEDIUM","M","D","A",80,"H055M48D-80",6870,6480,null,null,null,0.5,5.61,7.6,"H055M48D-80-A","AIR","208-230/1/60",15,15,6.7,600,"KIT","6-15R","SMALL",206,93.4,286,129.69999999999999]
["PACKAGED UNIT","H055M48","HERMETIC","448A",48,"MEDIUM","M","D","A",90,"H055M48D-90",6400,6040,null,null,null,0.5,5.61,7.6,"H055M48D-90-A","AIR","208-230/1/60",15,15,6.7,600,"KIT","6-15R","SMALL",206,93.4,286,129.69999999999999]
["PACKAGED UNIT","H055M48","HERMETIC","448A",48,"MEDIUM","M","D","A",95,"H055M48D-95",6170,5830,null,null,null,0.5,5.61,7.6,"H055M48D-95-A","AIR","208-230/1/60",15,15,6.7,600,"KIT","6-15R","SMALL",206,93.4,286,129.69999999999999]
["PACKAGED UNIT","O080D48","SCROLL","448A",48,"MEDIUM (ELECTRIC DEFROST)","D","D","E",100,"O080D48D-100",7660,7310,null,null,null,0.75,5.61,7.6,"O080D48D-100-E","ELECTRIC","208-230/1/60",15,15,8.3000000000000007,600,"KIT","6-15R","SMALL",206,93.4,286,129.69999999999999]
["PACKAGED UNIT","O080D48","SCROLL","448A",48,"MEDIUM (ELECTRIC DEFROST)","D","D","E",110,"O080D48D-110",7180,6850,null,null,null,0.75,5.61,7.6,"O080D48D-110-E","ELECTRIC","208-230/1/60",15,15,8.3000000000000007,600,"KIT","6-15R","SMALL",206,93.4,286,129.69999999999999]
["PACKAGED UNIT","O080D48","SCROLL","448A",48,"MEDIUM (ELECTRIC DEFROST)","D","D",{"$f":"IF(U34=\"AIR\",\"A\",\"E\")","v":"E"},80,{"$f":"B34&H34&\"-\"&J34","v":"O080D48D-80"},8600,8200,null,null,null,0.75,5.61,7.6,{"$f":"K34&\"-\"&I34","v":"O080D48D-80-E"},"ELECTRIC","208-230/1/60",15,15,8.3000000000000007,600,"KIT","6-15R","SMALL",206,93.4,286,129.69999999999999]
["PACKAGED UNIT","O080D48","SCROLL","448A",48,"MEDIUM (ELECTRIC DEFROST)","D","D","E",90,"O080D48D-90",8120,7750,null,null,null,0.75,5.61,7.6,"O080D48D-90-E","ELECTRIC","208-230/1/60",15,15,8.3000000000000007,600,"KIT","6-15R","SMALL",206,93.4,286,129.69999999999999]
["PACKAGED UNIT","O080D48","SCROLL","448A",48,"MEDIUM (ELECTRIC DEFROST)","D","D","E",95,"O080D48D-95",7890,7530,null,null,null,0.75,5.61,7.6,"O080D48D-95-E","ELECTRIC","208-230/1/60",15,15,8.3000000000000007,600,"KIT","6-15R","SMALL",206,93.4,286,129.69999999999999]
["PACKAGED UNIT","O080M48","SCROLL","448A",48,"MEDIUM","M","A","A",100,"O080M48A-100",7660,7310,null,null,null,0.75,5.61,7.6,"O080M48A-100-A","AIR","115/1/60",18.399999999999999,30,15.1,600,"KIT","5-20R","SMALL",206,93.4,286,129.69999999999999]
["PACKAGED UNIT","O080M48","SCROLL","448A",48,"MEDIUM","M","A","A",110,"O080M48A-110",7180,6850,null,null,null,0.75,5.61,7.6,"O080M48A-110-A","AIR","115/1/60",18.399999999999999,30,15.1,600,"KIT","5-20R","SMALL",206,93.4,286,129.69999999999999]
["PACKAGED UNIT","O080M48","SCROLL","448A",48,"MEDIUM","M","A","A",80,"O080M48A-80",8600,8200,null,null,null,0.75,5.61,7.6,"O080M48A-80-A","AIR","115/1/60",18.399999999999999,30,15.1,600,"KIT","5-20R","SMALL",206,93.4,286,129.69999999999999]
["PACKAGED UNIT","O080M48","SCROLL","448A",48,"MEDIUM","M","A","A",90,"O080M48A-90",8120,7750,null,null,null,0.75,5.61,7.6,"O080M48A-90-A","AIR","115/1/60",18.399999999999999,30,15.1,600,"KIT","5-20R","SMALL",206,93.4,286,129.69999999999999]
{"$rows_left_out":67}
{"sheet":"CabPics","index":2,"n_rows":3,"n_cols":2,"rows_kept":3,"cut":false,"hidden":true,"merged":[]}
["Pics","Cabinet"]
[null,"SMALL"]
[null,"LARGE"]

{"sheet":"Logos","index":3,"n_rows":3,"n_cols":2,"rows_kept":3,"cut":false,"hidden":true,"merged":[]}
[null,"Russell"]
[null,"Witt"]
[null,"Kramer"]

{"sheet":"Revisions","index":4,"n_rows":0,"n_cols":0,"rows_kept":0,"cut":false,"hidden":true,"merged":[]}